{"text_format":"1","workbook":"xlsx","n_sheets":10,"sheets":["Summary","Guidance on supplier invoices","MECC","Relief and Recovery Centres","Counter disaster ops-Households","Counter disaster ops-H and S","Asset restoration","Duplicate invoices check","Drop downs and lookups","Events as per ACMS"],"not_rendered":{"charts":0,"images":0,"macros":1,"external_links":0,"defined_names":6,"comments":0,"pivot_tables":5},"unopened":[],"bounds":{"document_bytes":16777216,"sheet_cells":100000,"rows_first":2000,"rows_last":500,"rows_between":2000,"halvings":0,"cell_chars":16384,"cell_head_chars":4096},"cells_cut":0,"cells_raw":0,"read":"whole","date_system":"1900"}

{"sheet":"Summary","index":0,"n_rows":33,"n_cols":14,"rows_kept":33,"cut":false,"hidden":false,"merged":[[29,9,29,10],[29,12,29,13],[0,0,0,4],[29,0,29,1],[29,3,29,4],[29,6,29,7]]}
["Natural Disaster Financial Assistance - Claim Summary"]
["Claimant",null,null,"Claimant Type",{"$f":"VLOOKUP(B2, 'Drop downs and lookups'!$A$2:$C$90, 3, 0)","v":{"$error":"#N/A"}}]
[]
["ACMS Name",{"$f":"VLOOKUP(B2, 'Drop downs and lookups'!$A$2:$C$90, 2, 0)","v":{"$error":"#N/A"}},null,"Claim Number"]
[]
["If you are a Catchment Management Authority, enter the Local Government Area(s) where disaster recovery work occurred:"]
[]
["Disaster event"]
[]
["Event date",{"$f":"VLOOKUP(B8, 'Events as per ACMS'!$B$2:$F$51, 2, 0)","v":{"$error":"#N/A"}}]
[]
["AGRN",{"$f":"VLOOKUP(B8, 'Events as per ACMS'!$B$2:$F$51, 4, 0)","v":{"$error":"#N/A"}}]
[]
["Active Event",{"$f":"VLOOKUP(B8, 'Events as per ACMS'!$B$2:$F$51, 5, 0)","v":{"$error":"#N/A"}}]
[]
["Subtotals"]
[]
["Municipal Emergency Coordination Centre",{"$f":"MECC!F94","v":0}]
["Relief and recovery centres",{"$f":"'Relief and Recovery Centres'!F94","v":0}]
["Counter disaster operations-Direct assistance to individuals or households",{"$f":"'Counter disaster ops-Households'!F94","v":0}]
["Counter disaster operations for the protection of the general public",{"$f":"'Counter disaster ops-H and S'!F94","v":0}]
["Asset restoration",{"$f":"'Asset restoration'!F94","v":0}]
[]
["Claim Total",{"$f":"SUM(B18:B22)","v":0}]
[]
["DHHS to assess yellow tabs (for a council claim)"]
["VicRoads to assess green tabs (for a council claim)"]
["DELWP to assess asset restoration tab (for a CMA claim)"]
[]
["Municipal Emergency Coordination Centre",null,null,"Relief and recovery centres",null,null,"Counter disaster operations-Direct assistance to individuals or households",null,null,"Counter disaster operations-Health and Safety",null,null,"Asset restoration"]
["Row Labels","Amount\n(excl GST)\n$",null,"Row Labels","Amount\n(excl GST)\n$",null,"Row Labels","Amount\n(excl GST)\n$",null,"Row Labels","Amount\n(excl GST)\n$",null,"Row Labels","Amount\n(excl GST)\n$"]
["N/A",null,null,"N/A",null,null,"N/A",null,null,"N/A",null,null,"N/A"]
["Grand Total",null,null,"Grand Total",null,null,"Grand Total",null,null,"Grand Total",null,null,"Grand Total"]

{"sheet":"Guidance on supplier invoices","index":1,"n_rows":0,"n_cols":0,"rows_kept":0,"cut":false,"hidden":false,"merged":[]}

{"sheet":"MECC","index":2,"n_rows":94,"n_cols":8,"rows_kept":94,"cut":false,"hidden":false,"merged":[[0,1,0,7]]}
[null,"Municipal Emergency Coordination Centre"]
[]
[]
[]
[]
[]
[]
[]
[]
[]
[]
[]
[]
[]
[]
[]
[]
[null,"Date","Invoice number","Supplier","Description","Amount\n(excl GST) \n$","Assessor comments","DTF Comments"]
[]
[]
[]
[]
[]
[]
[]
[]
[]
[]
[]
[]
[]
[]
[]
[]
[]
[]
[]
[]
[]
[]
[]
[]
[]
[]
[]
[]
[]
[]
[]
[]
[]
[]
[]
[]
[]
[]
[]
[]
[]
[]
{"$rows_left_out":35}
{"sheet":"Relief and Recovery Centres","index":3,"n_rows":94,"n_cols":8,"rows_kept":94,"cut":false,"hidden":false,"merged":[[0,1,0,7]]}
[null,"Relief and recovery centres"]
[]
[]
[]
[]
[]
[]
[]
[]
[]
[]
[]
[]
[]
[]
[]
[]
[null,"Date","Invoice number","Supplier","Description","Amount\n(excl GST) \n$","Assessor comments","DTF Comments"]
[]
[]
[]
[]
[]
[]
[]
[]
[]
[]
[]
[]
[]
[]
[]
[]
[]
[]
[]
[]
[]
[]
[]
[]
[]
[]
[]
[]
[]
[]
[]
[]
[]
[]
[]
[]
[]
[]
[]
[]
[]
[]
{"$rows_left_out":35}
{"sheet":"Counter disaster ops-Households","index":4,"n_rows":94,"n_cols":8,"rows_kept":94,"cut":false,"hidden":false,"merged":[[0,1,0,7]]}
[null,"Counter disaster operations-Direct assistance to individuals or households"]
[]
[]
[]
[]
[]
[]
[]
[]
[]
[]
[]
[]
[]
[]
[]
[]
[null,"Date","Invoice number","Supplier","Description","Amount\n(excl GST) \n$","Assessor comments","DTF Comments"]
[]
[]
[]
[]
[]
[]
[]
[]
[]
[]
[]
[]
[]
[]
[]
[]
[]
[]
[]
[]
[]
[]
[]
[]
[]
[]
[]
[]
[]
[]
[]
[]
[]
[]
[]
[]
[]
[]
[]
[]
[]
[]
{"$rows_left_out":35}
{"sheet":"Counter disaster ops-H and S","index":5,"n_rows":94,"n_cols":8,"rows_kept":94,"cut":false,"hidden":false,"merged":[[0,1,0,7]]}
[null,"Counter disaster operations-Health and Safety"]
[]
[]
[]
[]
[]
[]
[]
[]
[]
[]
[]
[]
[]
[]
[]
[]
[null,"Date","Invoice number","Supplier","Description","Amount\n(excl GST) \n$","Assessor comments","DTF Comments"]
[]
[]
[]
[]
[]
[]
[]
[]
[]
[]
[]
[]
[]
[]
[]
[]
[]
[]
[]
[]
[]
[]
[]
[]
[]
[]
[]
[]
[]
[]
[]
[]
[]
[]
[]
[]
[]
[]
[]
[]
[]
[]
{"$rows_left_out":35}
{"sheet":"Asset restoration","index":6,"n_rows":94,"n_cols":8,"rows_kept":94,"cut":false,"hidden":false,"merged":[[0,1,0,7]]}
[null,"Asset restoration"]
[]
[]
[]
[]
[]
[]
[]
[]
[]
[]
[]
[]
[]
[]
[]
[]
[null,"Date","Invoice number","Supplier","Description","Amount\n(excl GST) \n$","Assessor comments","DTF Comments"]
[]
[]
[]
[]
[]
[]
[]
[]
[]
[]
[]
[]
[]
[]
[]
[]
[]
[]
[]
[]
[]
[]
[]
[]
[]
[]
[]
[]
[]
[]
[]
[]
[]
[]
[]
[]
[]
[]
[]
[]
[]
[]
{"$rows_left_out":35}
{"sheet":"Duplicate invoices check","index":7,"n_rows":94,"n_cols":6,"rows_kept":94,"cut":false,"hidden":true,"merged":[[0,1,0,5]]}
[null,"Duplicate invoices check"]
[]
[]
[]
[]
[]
[]
[]
[]
[]
[]
[]
[]
[]
[]
[]
[]
[null,"Invoices MECC","Invoices Relief and recovery centres","Invoices CDO-Households","Invoices CDO-H and S","Invoices Asset restoration"]
[null,{"$f":"TRIM(MECC!C19)","v":""},{"$f":"TRIM('Relief and Recovery Centres'!C19)","v":""},{"$f":"TRIM('Counter disaster ops-Households'!C19)","v":""},{"$f":"TRIM('Counter disaster ops-H and S'!C19)","v":""},{"$f":"TRIM('Asset restoration'!C19)","v":""}]
[null,{"$f":"TRIM(MECC!C20)","v":""},{"$f":"TRIM('Relief and Recovery Centres'!C20)","v":""},{"$f":"TRIM('Counter disaster ops-Households'!C20)","v":""},{"$f":"TRIM('Counter disaster ops-H and S'!C20)","v":""},{"$f":"TRIM('Asset restoration'!C20)","v":""}]
[null,{"$f":"TRIM(MECC!C21)","v":""},{"$f":"TRIM('Relief and Recovery Centres'!C21)","v":""},{"$f":"TRIM('Counter disaster ops-Households'!C21)","v":""},{"$f":"TRIM('Counter disaster ops-H and S'!C21)","v":""},{"$f":"TRIM('Asset restoration'!C21)","v":""}]
[null,{"$f":"TRIM(MECC!C22)","v":""},{"$f":"TRIM('Relief and Recovery Centres'!C22)","v":""},{"$f":"TRIM('Counter disaster ops-Households'!C22)","v":""},{"$f":"TRIM('Counter disaster ops-H and S'!C22)","v":""},{"$f":"TRIM('Asset restoration'!C22)","v":""}]
[null,{"$f":"TRIM(MECC!C23)","v":""},{"$f":"TRIM('Relief and Recovery Centres'!C23)","v":""},{"$f":"TRIM('Counter disaster ops-Households'!C23)","v":""},{"$f":"TRIM('Counter disaster ops-H and S'!C23)","v":""},{"$f":"TRIM('Asset restoration'!C23)","v":""}]
[null,{"$f":"TRIM(MECC!C24)","v":""},{"$f":"TRIM('Relief and Recovery Centres'!C24)","v":""},{"$f":"TRIM('Counter disaster ops-Households'!C24)","v":""},{"$f":"TRIM('Counter disaster ops-H and S'!C24)","v":""},{"$f":"TRIM('Asset restoration'!C24)","v":""}]
[null,{"$f":"TRIM(MECC!C25)","v":""},{"$f":"TRIM('Relief and Recovery Centres'!C25)","v":""},{"$f":"TRIM('Counter disaster ops-Households'!C25)","v":""},{"$f":"TRIM('Counter disaster ops-H and S'!C25)","v":""},{"$f":"TRIM('Asset restoration'!C25)","v":""}]
[null,{"$f":"TRIM(MECC!C26)","v":""},{"$f":"TRIM('Relief and Recovery Centres'!C26)","v":""},{"$f":"TRIM('Counter disaster ops-Households'!C26)","v":""},{"$f":"TRIM('Counter disaster ops-H and S'!C26)","v":""},{"$f":"TRIM('Asset restoration'!C26)","v":""}]
[null,{"$f":"TRIM(MECC!C27)","v":""},{"$f":"TRIM('Relief and Recovery Centres'!C27)","v":""},{"$f":"TRIM('Counter disaster ops-Households'!C27)","v":""},{"$f":"TRIM('Counter disaster ops-H and S'!C27)","v":""},{"$f":"TRIM('Asset restoration'!C27)","v":""}]
[null,{"$f":"TRIM(MECC!C28)","v":""},{"$f":"TRIM('Relief and Recovery Centres'!C28)","v":""},{"$f":"TRIM('Counter disaster ops-Households'!C28)","v":""},{"$f":"TRIM('Counter disaster ops-H and S'!C28)","v":""},{"$f":"TRIM('Asset restoration'!C28)","v":""}]
[null,{"$f":"TRIM(MECC!C29)","v":""},{"$f":"TRIM('Relief and Recovery Centres'!C29)","v":""},{"$f":"TRIM('Counter disaster ops-Households'!C29)","v":""},{"$f":"TRIM('Counter disaster ops-H and S'!C29)","v":""},{"$f":"TRIM('Asset restoration'!C29)","v":""}]
[null,{"$f":"TRIM(MECC!C30)","v":""},{"$f":"TRIM('Relief and Recovery Centres'!C30)","v":""},{"$f":"TRIM('Counter disaster ops-Households'!C30)","v":""},{"$f":"TRIM('Counter disaster ops-H and S'!C30)","v":""},{"$f":"TRIM('Asset restoration'!C30)","v":""}]
[null,{"$f":"TRIM(MECC!C31)","v":""},{"$f":"TRIM('Relief and Recovery Centres'!C31)","v":""},{"$f":"TRIM('Counter disaster ops-Households'!C31)","v":""},{"$f":"TRIM('Counter disaster ops-H and S'!C31)","v":""},{"$f":"TRIM('Asset restoration'!C31)","v":""}]
[null,{"$f":"TRIM(MECC!C32)","v":""},{"$f":"TRIM('Relief and Recovery Centres'!C32)","v":""},{"$f":"TRIM('Counter disaster ops-Households'!C32)","v":""},{"$f":"TRIM('Counter disaster ops-H and S'!C32)","v":""},{"$f":"TRIM('Asset restoration'!C32)","v":""}]
[null,{"$f":"TRIM(MECC!C33)","v":""},{"$f":"TRIM('Relief and Recovery Centres'!C33)","v":""},{"$f":"TRIM('Counter disaster ops-Households'!C33)","v":""},{"$f":"TRIM('Counter disaster ops-H and S'!C33)","v":""},{"$f":"TRIM('Asset restoration'!C33)","v":""}]
[null,{"$f":"TRIM(MECC!C34)","v":""},{"$f":"TRIM('Relief and Recovery Centres'!C34)","v":""},{"$f":"TRIM('Counter disaster ops-Households'!C34)","v":""},{"$f":"TRIM('Counter disaster ops-H and S'!C34)","v":""},{"$f":"TRIM('Asset restoration'!C34)","v":""}]
[null,{"$f":"TRIM(MECC!C35)","v":""},{"$f":"TRIM('Relief and Recovery Centres'!C35)","v":""},{"$f":"TRIM('Counter disaster ops-Households'!C35)","v":""},{"$f":"TRIM('Counter disaster ops-H and S'!C35)","v":""},{"$f":"TRIM('Asset restoration'!C35)","v":""}]
[null,{"$f":"TRIM(MECC!C36)","v":""},{"$f":"TRIM('Relief and Recovery Centres'!C36)","v":""},{"$f":"TRIM('Counter disaster ops-Households'!C36)","v":""},{"$f":"TRIM('Counter disaster ops-H and S'!C36)","v":""},{"$f":"TRIM('Asset restoration'!C36)","v":""}]
[null,{"$f":"TRIM(MECC!C37)","v":""},{"$f":"TRIM('Relief and Recovery Centres'!C37)","v":""},{"$f":"TRIM('Counter disaster ops-Households'!C37)","v":""},{"$f":"TRIM('Counter disaster ops-H and S'!C37)","v":""},{"$f":"TRIM('Asset restoration'!C37)","v":""}]
[null,{"$f":"TRIM(MECC!C38)","v":""},{"$f":"TRIM('Relief and Recovery Centres'!C38)","v":""},{"$f":"TRIM('Counter disaster ops-Households'!C38)","v":""},{"$f":"TRIM('Counter disaster ops-H and S'!C38)","v":""},{"$f":"TRIM('Asset restoration'!C38)","v":""}]
[null,{"$f":"TRIM(MECC!C39)","v":""},{"$f":"TRIM('Relief and Recovery Centres'!C39)","v":""},{"$f":"TRIM('Counter disaster ops-Households'!C39)","v":""},{"$f":"TRIM('Counter disaster ops-H and S'!C39)","v":""},{"$f":"TRIM('Asset restoration'!C39)","v":""}]
[null,{"$f":"TRIM(MECC!C40)","v":""},{"$f":"TRIM('Relief and Recovery Centres'!C40)","v":""},{"$f":"TRIM('Counter disaster ops-Households'!C40)","v":""},{"$f":"TRIM('Counter disaster ops-H and S'!C40)","v":""},{"$f":"TRIM('Asset restoration'!C40)","v":""}]
[null,{"$f":"TRIM(MECC!C41)","v":""},{"$f":"TRIM('Relief and Recovery Centres'!C41)","v":""},{"$f":"TRIM('Counter disaster ops-Households'!C41)","v":""},{"$f":"TRIM('Counter disaster ops-H and S'!C41)","v":""},{"$f":"TRIM('Asset restoration'!C41)","v":""}]
[null,{"$f":"TRIM(MECC!C42)","v":""},{"$f":"TRIM('Relief and Recovery Centres'!C42)","v":""},{"$f":"TRIM('Counter disaster ops-Households'!C42)","v":""},{"$f":"TRIM('Counter disaster ops-H and S'!C42)","v":""},{"$f":"TRIM('Asset restoration'!C42)","v":""}]
[null,{"$f":"TRIM(MECC!C43)","v":""},{"$f":"TRIM('Relief and Recovery Centres'!C43)","v":""},{"$f":"TRIM('Counter disaster ops-Households'!C43)","v":""},{"$f":"TRIM('Counter disaster ops-H and S'!C43)","v":""},{"$f":"TRIM('Asset restoration'!C43)","v":""}]
[null,{"$f":"TRIM(MECC!C44)","v":""},{"$f":"TRIM('Relief and Recovery Centres'!C44)","v":""},{"$f":"TRIM('Counter disaster ops-Households'!C44)","v":""},{"$f":"TRIM('Counter disaster ops-H and S'!C44)","v":""},{"$f":"TRIM('Asset restoration'!C44)","v":""}]
[null,{"$f":"TRIM(MECC!C45)","v":""},{"$f":"TRIM('Relief and Recovery Centres'!C45)","v":""},{"$f":"TRIM('Counter disaster ops-Households'!C45)","v":""},{"$f":"TRIM('Counter disaster ops-H and S'!C45)","v":""},{"$f":"TRIM('Asset restoration'!C45)","v":""}]
[null,{"$f":"TRIM(MECC!C46)","v":""},{"$f":"TRIM('Relief and Recovery Centres'!C46)","v":""},{"$f":"TRIM('Counter disaster ops-Households'!C46)","v":""},{"$f":"TRIM('Counter disaster ops-H and S'!C46)","v":""},{"$f":"TRIM('Asset restoration'!C46)","v":""}]
[null,{"$f":"TRIM(MECC!C47)","v":""},{"$f":"TRIM('Relief and Recovery Centres'!C47)","v":""},{"$f":"TRIM('Counter disaster ops-Households'!C47)","v":""},{"$f":"TRIM('Counter disaster ops-H and S'!C47)","v":""},{"$f":"TRIM('Asset restoration'!C47)","v":""}]
[null,{"$f":"TRIM(MECC!C48)","v":""},{"$f":"TRIM('Relief and Recovery Centres'!C48)","v":""},{"$f":"TRIM('Counter disaster ops-Households'!C48)","v":""},{"$f":"TRIM('Counter disaster ops-H and S'!C48)","v":""},{"$f":"TRIM('Asset restoration'!C48)","v":""}]
[null,{"$f":"TRIM(MECC!C49)","v":""},{"$f":"TRIM('Relief and Recovery Centres'!C49)","v":""},{"$f":"TRIM('Counter disaster ops-Households'!C49)","v":""},{"$f":"TRIM('Counter disaster ops-H and S'!C49)","v":""},{"$f":"TRIM('Asset restoration'!C49)","v":""}]
[null,{"$f":"TRIM(MECC!C50)","v":""},{"$f":"TRIM('Relief and Recovery Centres'!C50)","v":""},{"$f":"TRIM('Counter disaster ops-Households'!C50)","v":""},{"$f":"TRIM('Counter disaster ops-H and S'!C50)","v":""},{"$f":"TRIM('Asset restoration'!C50)","v":""}]
[null,{"$f":"TRIM(MECC!C51)","v":""},{"$f":"TRIM('Relief and Recovery Centres'!C51)","v":""},{"$f":"TRIM('Counter disaster ops-Households'!C51)","v":""},{"$f":"TRIM('Counter disaster ops-H and S'!C51)","v":""},{"$f":"TRIM('Asset restoration'!C51)","v":""}]
[null,{"$f":"TRIM(MECC!C52)","v":""},{"$f":"TRIM('Relief and Recovery Centres'!C52)","v":""},{"$f":"TRIM('Counter disaster ops-Households'!C52)","v":""},{"$f":"TRIM('Counter disaster ops-H and S'!C52)","v":""},{"$f":"TRIM('Asset restoration'!C52)","v":""}]
[null,{"$f":"TRIM(MECC!C53)","v":""},{"$f":"TRIM('Relief and Recovery Centres'!C53)","v":""},{"$f":"TRIM('Counter disaster ops-Households'!C53)","v":""},{"$f":"TRIM('Counter disaster ops-H and S'!C53)","v":""},{"$f":"TRIM('Asset restoration'!C53)","v":""}]
[null,{"$f":"TRIM(MECC!C54)","v":""},{"$f":"TRIM('Relief and Recovery Centres'!C54)","v":""},{"$f":"TRIM('Counter disaster ops-Households'!C54)","v":""},{"$f":"TRIM('Counter disaster ops-H and S'!C54)","v":""},{"$f":"TRIM('Asset restoration'!C54)","v":""}]
[null,{"$f":"TRIM(MECC!C55)","v":""},{"$f":"TRIM('Relief and Recovery Centres'!C55)","v":""},{"$f":"TRIM('Counter disaster ops-Households'!C55)","v":""},{"$f":"TRIM('Counter disaster ops-H and S'!C55)","v":""},{"$f":"TRIM('Asset restoration'!C55)","v":""}]
[null,{"$f":"TRIM(MECC!C56)","v":""},{"$f":"TRIM('Relief and Recovery Centres'!C56)","v":""},{"$f":"TRIM('Counter disaster ops-Households'!C56)","v":""},{"$f":"TRIM('Counter disaster ops-H and S'!C56)","v":""},{"$f":"TRIM('Asset restoration'!C56)","v":""}]
[null,{"$f":"TRIM(MECC!C57)","v":""},{"$f":"TRIM('Relief and Recovery Centres'!C57)","v":""},{"$f":"TRIM('Counter disaster ops-Households'!C57)","v":""},{"$f":"TRIM('Counter disaster ops-H and S'!C57)","v":""},{"$f":"TRIM('Asset restoration'!C57)","v":""}]
[null,{"$f":"TRIM(MECC!C58)","v":""},{"$f":"TRIM('Relief and Recovery Centres'!C58)","v":""},{"$f":"TRIM('Counter disaster ops-Households'!C58)","v":""},{"$f":"TRIM('Counter disaster ops-H and S'!C58)","v":""},{"$f":"TRIM('Asset restoration'!C58)","v":""}]
[null,{"$f":"TRIM(MECC!C59)","v":""},{"$f":"TRIM('Relief and Recovery Centres'!C59)","v":""},{"$f":"TRIM('Counter disaster ops-Households'!C59)","v":""},{"$f":"TRIM('Counter disaster ops-H and S'!C59)","v":""},{"$f":"TRIM('Asset restoration'!C59)","v":""}]
[null,{"$f":"TRIM(MECC!C60)","v":""},{"$f":"TRIM('Relief and Recovery Centres'!C60)","v":""},{"$f":"TRIM('Counter disaster ops-Households'!C60)","v":""},{"$f":"TRIM('Counter disaster ops-H and S'!C60)","v":""},{"$f":"TRIM('Asset restoration'!C60)","v":""}]
{"$rows_left_out":35}
{"sheet":"Drop downs and lookups","index":8,"n_rows":90,"n_cols":3,"rows_kept":90,"cut":false,"hidden":true,"merged":[]}
["Council Full Name","ACMS Name","Type"]
["Alpine Shire Council","Alpine","Council"]
["Ararat Rural City Council","Ararat","Council"]
["Ballarat City Council","Ballarat","Council"]
["Banyule City Council","Banyule","Council"]
["Bass Coast Shire Council","Bass Coast","Council"]
["Baw Baw Shire Council","BawBaw","Council"]
["Bayside City Council","Bayside","Council"]
["Benalla Rural City Council","Benalla","Council"]
["Boroondara City Council","Boroondara","Council"]
["Brimbank City Council","Brimbank","Council"]
["Buloke Shire Council","Buloke","Council"]
["Campaspe Shire Council","Campaspe","Council"]
["Cardinia Shire Council","Cardinia","Council"]
["Casey City Council","Casey","Council"]
["Central Goldfields Shire Council","Goldfields","Council"]
["Colac Otway Shire Council","Otway","Council"]
["Corangamite Shire Council","Corangamite","Council"]
["Darebin City Council","Darebin","Council"]
["East Gippsland Shire Council","EastGippsland","Council"]
["Frankston City Council","Frankston","Council"]
["Gannawarra Shire Council","Gannawarra","Council"]
["Glen Eira City Council","GlenEira","Council"]
["Glenelg Shire Council","Glenelg","Council"]
["Golden Plains Shire Council","GoldenPlains","Council"]
["Greater Bendigo City Council","Bendigo","Council"]
["Greater Dandenong City Council","Dandenong","Council"]
["Greater Geelong City Council","Geelong","Council"]
["Greater Shepparton City Council","Shepparton","Council"]
["Hepburn Shire Council","Hepburn","Council"]
["Hindmarsh Shire Council","Hindmarsh","Council"]
["Hobsons Bay City Council","Hobsons","Council"]
["Horsham Rural City Council","Horsham","Council"]
["Hume City Council","Hume","Council"]
["Indigo Shire Council","Indigo","Council"]
["Kingston City Council","Kingston","Council"]
["Knox City Council","Knox","Council"]
["Latrobe City Council","Latrobe","Council"]
["Loddon Shire Council","Loddon","Council"]
["Macedon Ranges Shire Council","Macedon","Council"]
["Manningham City Council","Manningham","Council"]
["Mansfield Shire Council","Mansfield","Council"]
["Maribyrnong City Council","Maribyrnong","Council"]
["Maroondah City Council","Maroondah","Council"]
["Melbourne City Council","Melbourne","Council"]
["Melton City Council","Melton","Council"]
["Mildura Rural City Council","Mildura","Council"]
["Mitchell Shire Council","Mitchell","Council"]
["Moira Shire Council","Moira","Council"]
["Monash City Council","Monash","Council"]
["Moonee Valley City Council","MooneeValley","Council"]
["Moorabool Shire Council","Moorabool","Council"]
["Moreland City Council","Moreland","Council"]
["Mornington Peninsula Shire Council","Mornington","Council"]
["Mount Alexander Shire Council","MtAlexander","Council"]
["Moyne Shire Council","Moyne","Council"]
["Murrindindi Shire Council","Murrindindi","Council"]
["Nillumbik Shire Council","Nillumbik","Council"]
["Northern Grampians Shire Council","NGrampians","Council"]
["Port Philip City Council","PortPhillip","Council"]
{"$rows_left_out":31}
{"sheet":"Events as per ACMS","index":9,"n_rows":51,"n_cols":6,"rows_kept":51,"cut":false,"hidden":true,"merged":[]}
[null,"Event Name","Event Date","End allowable time period","AGRN","Active"]
[null,"Victoria Storms and Floods - 29 December 2016","2016-12-29","2019-06-30",736,"Yes"]
[null,"Victorian Storms - Mildura (11 November 2016)","2016-11-11","2019-06-30",733,"Yes"]
[null,"Victoria Floods and Storms (September/October 2016)","2016-09-09","2019-06-30",728,"Yes"]
[null,"North East Flooding (23 July 2016)","2016-07-23","2019-07-07",0,"Yes"]
[null,"Eastern Victoria Storms (12 July 2016)","2016-07-12","2019-06-30",724,"Yes"]
[null,"Gippsland Floods (5 July 2016)","2016-07-05","2019-06-30",721,"Yes"]
[null,"Eastern Victoria Storms (May 2016)","2016-05-03","2018-06-30",713,"Yes"]
[null,"Central and Eastern Victoria Storms (April 2016)","2016-04-30","2018-06-30",712,"Yes"]
[null,"Storms and Flooding (18 March 2016)","2016-03-18","2018-06-30",0,"Yes"]
[null,"Victoria Bushfires (23 February 2016)","2016-02-23","2018-06-30",701,"Yes"]
[null,"Victoria Geelong Storm Event (27 January 2016)","2016-01-27","2018-06-30",697,"Yes"]
[null,"Macedon Ranges Bushfire (19 January 2016)","2016-01-19","2018-06-30",0,"Yes"]
[null,"Victoria Mornington Peninsula Bushfire (18 January 2016)","2016-01-18","2018-06-30",695,"Yes"]
[null,"Victorian Bushfires (19 December 2015)","2015-12-19","2018-06-30",689,"Yes"]
[null,"Eastern Victoria Storms and Floods (8 December 2015)","2015-12-08","2018-06-30",690,"Yes"]
[null,"Victoria Storms (26 November 2015)","2015-11-25","2018-06-30",683,"Yes"]
[null,"North East Storms (1 November 2015)","2015-11-01","2018-06-30",0,"Yes"]
[null,"Victorian Bushfires (3 October 2015)","2015-10-03","2018-06-30",676,"Yes"]
[null,"South East Victoria Floods (27 August 2015)","2015-08-27","2018-06-30",674,"Yes"]
[null,"Victoria Storms (28 February 2015)","2015-02-28","2017-06-30",662,"Yes"]
[null,"Yarra Ranges Storms (13 February 2015)","2015-02-13","2017-06-30",658,"Yes"]
[null,"Halls Gap Flooding (13 January 2015)","2015-01-13","2017-06-30",659,"Yes"]
[null,"Victoria - Storms and Floods (7 January 2015)","2015-01-07","2017-06-30",647,"Yes"]
[null,"Victorian Bushfires (7 January 2015)","2015-01-07","2017-06-30",0,"Yes"]
[null,"Victoria - Bushfires (2 January 2015)","2015-01-02","2017-06-30",642,"Yes"]
[null,"Pastoria Bushfire - Macedon (16 December 2014)","2014-12-16","2017-06-30",0,"Yes"]
[null,"Victoria - Bushfires (16 December 2014)","2014-12-16","2017-06-30",644,"Yes"]
[null,"Victoria - Gippsland Floods (6-7 December 2014)","2014-12-06","2017-06-30",645,"Yes"]
[null,"Victoria Storms and Floods (8 September 2014)","2014-09-08","2017-06-30",638,"Yes"]
[null,"Victoria storms (30 July 2014) ","2014-07-30","2017-06-30",637,"Yes"]
[null,"Victorian Storms (24 June 2014) ","2014-06-24","2016-06-30",635,"Yes"]
[null,"Victoria East Gippsland Flooding (14 June 2014)","2014-06-14","2016-06-30",633,"Yes"]
[null,"Flood (19 February 2014)","2014-02-19","2016-06-30",0,"Yes"]
[null,"Victorian bushfires (7 February 2014)","2014-02-07","2016-06-30",608,"Yes"]
[null,"Victoria Bushfires (15 January 2014)","2014-01-15","2016-06-30",602,"Yes"]
[null,"Storm (October 2013)","2013-10-22","2016-06-30",0,"Yes"]
[null,"Victoria storms (26 September 2013)","2013-10-03","2016-06-30",584,"Yes"]
[null,"Victoria Storms and Floods (12 August 2013)","2013-08-12","2016-06-30",581,"Yes"]
[null,"Victoria Floods (12 June 2013)","2013-06-12","2015-06-30",575,"Yes"]
[null,"Victoria Storms and Tornadoes (21 March 2013)","2013-03-21","2015-06-30",555,"Yes"]
[null,"Victoria Eastern Victoria Bushfires (January 2013)","2013-01-17","2015-06-30",540,"Yes"]
[null,"Victoria South West Victoria Bushfires (January 2013)","2013-01-01","2015-06-30",539,"Yes"]
[null,"Storm (November 2012)","2012-11-30","2015-06-30",0,"Yes"]
[null,"Victoria Severe Storms (5-8 September 2012)","2012-08-05","2015-06-30",503,"Yes"]
[null,"Victoria Bushfires (March 2013)","2013-03-27","2015-06-30",557,"No"]
[null,"Victoria Bushfires (February 2013)","2013-02-01","2015-06-30",550,"No"]
[null,"Victoria Casterton Bushfire (November 2012)","2012-11-01","2015-06-30",552,"No"]
[null,"Victoria Hippo Track Bushfire (October 2012)","2012-10-01","2015-06-30",551,"No"]
[null,"Victoria Yarra Ranges Flood (2 July 2012)","2012-07-02","2015-06-30",501,"No"]
[null,"Victorian Flood (January 2011)","2011-01-01","2014-06-30",0,"No"]